L'obtention de Construire a échoué avec une Exception Android Studio 0.4.3 et 0.4.4

C'est mon problème:

depuis que j'ai mis à jour Android Studio .4.3 chaque fois que j'essaie de faire un nouveau projet que j'obtiens de Construire l'échec, la chose se produit avec chaque nouveau projet, pas de code de mon propre là...

Jetons un coup d'oeil:

Android code:

package com.appgcm;
import android.support.v7.app.ActionBarActivity;
import android.support.v7.app.ActionBar;
import android.support.v4.app.Fragment;
import android.os.Bundle;
import android.view.LayoutInflater;
import android.view.Menu;
import android.view.MenuItem;
import android.view.View;
import android.view.ViewGroup;
import android.os.Build;
public class MainActivity extends ActionBarActivity {
@Override
protected void onCreate(Bundle savedInstanceState) {
super.onCreate(savedInstanceState);
setContentView(R.layout.activity_main);
if (savedInstanceState == null) {
getSupportFragmentManager().beginTransaction()
.add(R.id.container, new PlaceholderFragment())
.commit();
}
}
@Override
public boolean onCreateOptionsMenu(Menu menu) {
//Inflate the menu; this adds items to the action bar if it is present.
getMenuInflater().inflate(R.menu.main, menu);
return true;
}
@Override
public boolean onOptionsItemSelected(MenuItem item) {
//Handle action bar item clicks here. The action bar will
//automatically handle clicks on the Home/Up button, so long
//as you specify a parent activity in AndroidManifest.xml.
int id = item.getItemId();
if (id == R.id.action_settings) {
return true;
}
return super.onOptionsItemSelected(item);
}
/**
* A placeholder fragment containing a simple view.
*/
public static class PlaceholderFragment extends Fragment {
public PlaceholderFragment() {
}
@Override
public View onCreateView(LayoutInflater inflater, ViewGroup container,
Bundle savedInstanceState) {
View rootView = inflater.inflate(R.layout.fragment_main, container, false);
return rootView;
}
}

}

Construire.gradle

apply plugin: 'android'
android {
compileSdkVersion 19
buildToolsVersion "17.0.0"
defaultConfig {
minSdkVersion 7
targetSdkVersion 19
versionCode 1
versionName "1.0"
}
buildTypes {
release {
runProguard false
proguardFiles getDefaultProguardFile('proguard-android.txt'), 'proguard rules.txt'
}
}
}
dependencies {
compile 'com.android.support:appcompat-v7:+'
compile fileTree(dir: 'libs', include: ['*.jar', '*.aar'])
}

Gradle d'erreur de la console:

Executing tasks: [:appgcm:generateDebugSources]
Relying on packaging to define the extension of the main artifact has been deprecated     and is scheduled to be removed in Gradle 2.0
:appgcm:preBuild FAILED
FAILURE: Build failed with an exception.
* What went wrong:
Execution failed for task ':appgcm:preBuild'.
> Build Tools Revision 19.0.0+ is required.
* Try:
Run with --stacktrace option to get the stack trace. Run with --info or --debug option     to get more log output.
BUILD FAILED
Total time: 3.265 secs

Ok, je pense que c'est assez d'information pour prendre quelque chose, je ne suis toujours pas très expert avec gradle, de sorte que le détail de vos explications le mieux.

Merci beaucoup!

EDIT:

J'ai pris l'avis de pyus13 et maintenant, je suis gatting une autre sorte d'erreur, c'est ici:

FAILURE: Build failed with an exception.
* Where:
Build file 'C:\Users\pandolet\workspace\APPGCM\appgcm\build.gradle' line: 1
* What went wrong:
A problem occurred evaluating project ':appgcm'.
> Plugin with id 'android' not found.
* Try:
Run with --stacktrace option to get the stack trace. Run with --info or --debug option to get more log output.
BUILD FAILED
Total time: 0.306 secs

Au niveau de la racine de construire.gradle:

//Top-level build file where you can add configuration options common to all sub-projects/modules.
buildscript {
repositories {
mavenCentral()
}
dependencies {
'com.android.tools.build:gradle:0.8.+'
}
}
allprojects {
repositories {
mavenCentral()
}
}
InformationsquelleAutor Luis | 2014-02-08